[uClinux-dev] Compile Errors on uCLinux

Paul G. Allen pgallen at gmail.com
Tue Oct 4 13:59:04 EDT 2005

The patch for the config file fixed one problem (missing Makefile when
building for armnommu), but now I get the following error when running

[root at telgar uClinux-dist-test]# make V=1 ARCH=arm
CROSS_COMPILE=arm-elf- -C linux-2.6.x

[Many successful compile commands]

arch/arm/kernel/sys_arm.c: In function `do_mmap2':
arch/arm/kernel/sys_arm.c:66: error: `FIRST_USER_ADDRESS' undeclared
(first use in this function)
arch/arm/kernel/sys_arm.c:66: error: (Each undeclared identifier is
reported only once
arch/arm/kernel/sys_arm.c:66: error: for each function it appears in.)
make[1]: *** [arch/arm/kernel/sys_arm.o] Error 1
make: *** [arch/arm/kernel] Error 2
make: Leaving directory `/usr/local/Quake/uClinux-dist-test/linux-2.6.x'

Again, this is for GDB ARMulator, Atmel AT91.

Paul G. Allen
Software Engineer
QUAKE Global, Inc.

More information about the uClinux-dev mailing list